{"text_format":"1","workbook":"xlsx","n_sheets":13,"sheets":["January","February","March","April","May","June","July","Aug","Sep","Oct","Nov","Dec","BD1"],"not_rendered":{"charts":0,"images":2,"macros":1,"external_links":0,"defined_names":25,"comments":12,"pivot_tables":0},"unopened":[],"bounds":{"document_bytes":16777216,"sheet_cells":100000,"rows_first":2000,"rows_last":500,"rows_between":2000,"halvings":0,"cell_chars":16384,"cell_head_chars":4096},"cells_cut":0,"cells_raw":0,"read":"whole","date_system":"1900"}

{"sheet":"January","index":0,"n_rows":35,"n_cols":43,"rows_kept":35,"cut":false,"hidden":false,"merged":[[5,6,5,8],[6,3,6,42],[11,7,11,12],[8,7,8,31],[9,7,9,31],[10,7,10,31],[14,3,15,3],[14,4,15,4],[30,32,30,41],[33,32,33,41],[34,32,34,41],[30,17,30,26],[33,17,33,26],[34,17,34,26]]}
[]
[null,null,null,null,null,null,null,null,"File Name",null,null,null,{"$f":"CONCATENATE(CalendarYear,\".\",F6,\".\",VLOOKUP(H10,'BD1'!B16:D35,3,FALSE),\".\",H10)","v":{"$error":"#N/A"}}]
[null,null,null,null,null,null,null,null,"Sheet Name",null,null,null,{"$f":"CONCATENATE(E6,\".\",CalendarYear)","v":"January.2021"}]
[null,null,null,"Beginning of the week","SUN"]
[null,null,null,"Year",2021]
[null,null,null,"Month","January",{"$f":"VLOOKUP(E6,'BD1'!B2:C13,2,FALSE)","v":"01"}]
[null,null,null,"TIMESHEET"]
[]
[null,null,null,null,null,null,"DEPARTMENT/SERVICE: "]
[null,null,null,null,null,null,"NAME:"]
[null,null,null,null,null,null,"CATEGORY:"]
[null,null,null,null,null,null,"MONHT/YEAR:",{"$f":"CONCATENATE(E6,\"/\",CalendarYear)","v":"January/2021"}]
[]
[null,null,null,null,null,{"$f":"AND(MONTH(F16)=MONTH($G$6),COUNTIF(feriados,F16)>0)","v":false},false,false,false,false,true,false,false,false,false,false,false,false,false,false,false,false,false,false,false,false,false,false,false,false,false,false,false,false,false,false,false,false,false,false,false,false]
[null,null,null,"Project ","Tasks","Sun","Mon","Tue","Wed","Thu","Fri","Sat","Sun","Mon","Tue","Wed","Thu","Fri","Sat","Sun","Mon","Tue","Wed","Thu","Fri","Sat","Sun","Mon","Tue","Wed","Thu","Fri","Sat","Sun","Mon","Tue","Wed","Thu","Fri","Sat","Sun","Mon","TOTAL "]
{"$rows_left_out":21}
{"sheet":"February","index":1,"n_rows":35,"n_cols":43,"rows_kept":35,"cut":false,"hidden":false,"merged":[[11,7,11,12],[5,6,5,8],[6,3,6,42],[8,7,8,31],[9,7,9,31],[10,7,10,31],[14,3,15,3],[14,4,15,4],[34,17,34,26],[34,32,34,41],[30,17,30,26],[30,32,30,41],[33,17,33,26],[33,32,33,41]]}
[]
[null,null,null,null,null,null,null,null,"File Name",null,null,null,{"$f":"CONCATENATE(CalendarYear,\".\",F6,\".\",VLOOKUP(H10,'BD1'!B16:D35,3,FALSE),\".\",H10)","v":{"$error":"#N/A"}}]
[null,null,null,null,null,null,null,null,"Sheet Name",null,null,null,{"$f":"CONCATENATE(E6,\".\",CalendarYear)","v":"February.2021"}]
[null,null,null,"Beginning of the week","SUN"]
[null,null,null,"Year",2021]
[null,null,null,"Month","February",{"$f":"VLOOKUP(E6,'BD1'!B2:C13,2,FALSE)","v":"02"}]
[null,null,null,"TIMESHEET"]
[]
[null,null,null,null,null,null,"DEPARTMENT/SERVICE: "]
[null,null,null,null,null,null,"NAME:"]
[null,null,null,null,null,null,"CATEGORY:"]
[null,null,null,null,null,null,"MONHT/YEAR:",{"$f":"CONCATENATE(E6,\"/\",CalendarYear)","v":"February/2021"}]
[]
[null,null,null,null,null,{"$f":"AND(MONTH(F16)=MONTH($G$6),COUNTIF(feriados,F16)>0)","v":false},false,false,false,false,false,false,false,false,false,false,false,false,false,false,false,false,false,false,false,false,false,false,false,false,false,false,false,false,false,false,false,false,false,false,false,false]
[null,null,null,"Project ","Tasks","Sun","Mon","Tue","Wed","Thu","Fri","Sat","Sun","Mon","Tue","Wed","Thu","Fri","Sat","Sun","Mon","Tue","Wed","Thu","Fri","Sat","Sun","Mon","Tue","Wed","Thu","Fri","Sat","Sun","Mon","Tue","Wed","Thu","Fri","Sat","Sun","Mon","TOTAL "]
{"$rows_left_out":21}
{"sheet":"March","index":2,"n_rows":35,"n_cols":43,"rows_kept":35,"cut":false,"hidden":false,"merged":[[11,7,11,12],[5,6,5,8],[6,3,6,42],[8,7,8,31],[9,7,9,31],[10,7,10,31],[34,17,34,26],[34,32,34,41],[14,3,15,3],[14,4,15,4],[30,17,30,26],[30,32,30,41],[33,17,33,26],[33,32,33,41]]}
[]
[null,null,null,null,null,null,null,null,"File Name",null,null,null,{"$f":"CONCATENATE(CalendarYear,\".\",F6,\".\",VLOOKUP(H10,'BD1'!B16:D35,3,FALSE),\".\",H10)","v":{"$error":"#N/A"}}]
[null,null,null,null,null,null,null,null,"Sheet Name",null,null,null,{"$f":"CONCATENATE(E6,\".\",CalendarYear)","v":"March.2021"}]
[null,null,null,"Beginning of the week","SUN"]
[null,null,null,"Year",2021]
[null,null,null,"Month","March",{"$f":"VLOOKUP(E6,'BD1'!B2:C13,2,FALSE)","v":"03"}]
[null,null,null,"TIMESHEET"]
[]
[null,null,null,null,null,null,"DEPARTMENT/SERVICE: "]
[null,null,null,null,null,null,"NAME:"]
[null,null,null,null,null,null,"CATEGORY:"]
[null,null,null,null,null,null,"MONHT/YEAR:",{"$f":"CONCATENATE(E6,\"/\",CalendarYear)","v":"March/2021"}]
[]
[null,null,null,null,null,{"$f":"AND(MONTH(F16)=MONTH($G$6),COUNTIF(feriados,F16)>0)","v":false},false,false,false,false,false,false,false,false,false,false,false,false,false,false,false,false,false,false,false,false,false,false,false,false,false,false,false,false,false,false,false,false,false,false,false,false]
[null,null,null,"Project ","Tasks","Sun","Mon","Tue","Wed","Thu","Fri","Sat","Sun","Mon","Tue","Wed","Thu","Fri","Sat","Sun","Mon","Tue","Wed","Thu","Fri","Sat","Sun","Mon","Tue","Wed","Thu","Fri","Sat","Sun","Mon","Tue","Wed","Thu","Fri","Sat","Sun","Mon","TOTAL "]
{"$rows_left_out":21}
{"sheet":"April","index":3,"n_rows":35,"n_cols":43,"rows_kept":35,"cut":false,"hidden":false,"merged":[[11,7,11,12],[5,6,5,8],[6,3,6,42],[8,7,8,31],[9,7,9,31],[10,7,10,31],[14,3,15,3],[14,4,15,4],[34,17,34,26],[34,32,34,41],[30,17,30,26],[30,32,30,41],[33,17,33,26],[33,32,33,41]]}
[]
[null,null,null,null,null,null,null,null,"File Name",null,null,null,{"$f":"CONCATENATE(CalendarYear,\".\",F6,\".\",VLOOKUP(H10,'BD1'!B16:D35,3,FALSE),\".\",H10)","v":{"$error":"#N/A"}}]
[null,null,null,null,null,null,null,null,"Sheet Name",null,null,null,{"$f":"CONCATENATE(E6,\".\",CalendarYear)","v":"April.2021"}]
[null,null,null,"Beginning of the week","SUN"]
[null,null,null,"Year",2021]
[null,null,null,"Month","April",{"$f":"VLOOKUP(E6,'BD1'!B2:C13,2,FALSE)","v":"04"}]
[null,null,null,"TIMESHEET"]
[]
[null,null,null,null,null,null,"DEPARTMENT/SERVICE: "]
[null,null,null,null,null,null,"NAME:"]
[null,null,null,null,null,null,"CATEGORY:"]
[null,null,null,null,null,null,"MONHT/YEAR:",{"$f":"CONCATENATE(E6,\"/\",CalendarYear)","v":"April/2021"}]
[]
[null,null,null,null,null,{"$f":"AND(MONTH(F16)=MONTH($G$6),COUNTIF(feriados,F16)>0)","v":false},false,false,false,false,false,false,false,false,false,false,false,false,false,false,false,false,false,false,false,false,false,false,false,false,false,false,false,false,false,false,false,false,false,false,false,false]
[null,null,null,"Project ","Tasks","Sun","Mon","Tue","Wed","Thu","Fri","Sat","Sun","Mon","Tue","Wed","Thu","Fri","Sat","Sun","Mon","Tue","Wed","Thu","Fri","Sat","Sun","Mon","Tue","Wed","Thu","Fri","Sat","Sun","Mon","Tue","Wed","Thu","Fri","Sat","Sun","Mon","TOTAL "]
{"$rows_left_out":21}
{"sheet":"May","index":4,"n_rows":35,"n_cols":43,"rows_kept":35,"cut":false,"hidden":false,"merged":[[11,7,11,12],[5,6,5,8],[6,3,6,42],[8,7,8,31],[9,7,9,31],[10,7,10,31],[34,17,34,26],[34,32,34,41],[14,3,15,3],[14,4,15,4],[30,17,30,26],[30,32,30,41],[33,17,33,26],[33,32,33,41]]}
[]
[null,null,null,null,null,null,null,null,"File Name",null,null,null,{"$f":"CONCATENATE(CalendarYear,\".\",F6,\".\",VLOOKUP(H10,'BD1'!B16:D35,3,FALSE),\".\",H10)","v":{"$error":"#N/A"}}]
[null,null,null,null,null,null,null,null,"Sheet Name",null,null,null,{"$f":"CONCATENATE(E6,\".\",CalendarYear)","v":"May.2021"}]
[null,null,null,"Beginning of the week","SUN"]
[null,null,null,"Year",2021]
[null,null,null,"Month","May",{"$f":"VLOOKUP(E6,'BD1'!B2:C13,2,FALSE)","v":"05"}]
[null,null,null,"TIMESHEET"]
[]
[null,null,null,null,null,null,"DEPARTMENT/SERVICE: "]
[null,null,null,null,null,null,"NAME:"]
[null,null,null,null,null,null,"CATEGORY:"]
[null,null,null,null,null,null,"MONHT/YEAR:",{"$f":"CONCATENATE(E6,\"/\",CalendarYear)","v":"May/2021"}]
[]
[null,null,null,null,null,{"$f":"AND(MONTH(F16)=MONTH($G$6),COUNTIF(feriados,F16)>0)","v":false},false,false,false,false,false,false,false,false,false,false,false,false,false,false,false,false,false,false,false,false,false,false,false,false,false,false,false,false,false,false,false,false,false,false,false,false]
[null,null,null,"Project ","Tasks","Sun","Mon","Tue","Wed","Thu","Fri","Sat","Sun","Mon","Tue","Wed","Thu","Fri","Sat","Sun","Mon","Tue","Wed","Thu","Fri","Sat","Sun","Mon","Tue","Wed","Thu","Fri","Sat","Sun","Mon","Tue","Wed","Thu","Fri","Sat","Sun","Mon","TOTAL "]
{"$rows_left_out":21}
{"sheet":"June","index":5,"n_rows":35,"n_cols":43,"rows_kept":35,"cut":false,"hidden":false,"merged":[[11,7,11,12],[5,6,5,8],[6,3,6,42],[8,7,8,31],[9,7,9,31],[10,7,10,31],[34,17,34,26],[34,32,34,41],[14,3,15,3],[14,4,15,4],[30,17,30,26],[30,32,30,41],[33,17,33,26],[33,32,33,41]]}
[]
[null,null,null,null,null,null,null,null,"File Name",null,null,null,{"$f":"CONCATENATE(CalendarYear,\".\",F6,\".\",VLOOKUP(H10,'BD1'!B16:D35,3,FALSE),\".\",H10)","v":{"$error":"#N/A"}}]
[null,null,null,null,null,null,null,null,"Sheet Name",null,null,null,{"$f":"CONCATENATE(E6,\".\",CalendarYear)","v":"June.2021"}]
[null,null,null,"Beginning of the week","SUN"]
[null,null,null,"Year",2021]
[null,null,null,"Month","June",{"$f":"VLOOKUP(E6,'BD1'!B2:C13,2,FALSE)","v":"06"}]
[null,null,null,"TIMESHEET"]
[]
[null,null,null,null,null,null,"DEPARTMENT/SERVICE: "]
[null,null,null,null,null,null,"NAME:"]
[null,null,null,null,null,null,"CATEGORY:"]
[null,null,null,null,null,null,"MONHT/YEAR:",{"$f":"CONCATENATE(E6,\"/\",CalendarYear)","v":"June/2021"}]
[]
[null,null,null,null,null,{"$f":"AND(MONTH(F16)=MONTH($G$6),COUNTIF(feriados,F16)>0)","v":false},false,false,false,false,false,false,false,false,false,false,false,false,false,false,false,false,false,false,false,false,false,false,false,false,false,false,false,false,false,false,false,false,false,false,false,false]
[null,null,null,"Project ","Tasks","Sun","Mon","Tue","Wed","Thu","Fri","Sat","Sun","Mon","Tue","Wed","Thu","Fri","Sat","Sun","Mon","Tue","Wed","Thu","Fri","Sat","Sun","Mon","Tue","Wed","Thu","Fri","Sat","Sun","Mon","Tue","Wed","Thu","Fri","Sat","Sun","Mon","TOTAL "]
{"$rows_left_out":21}
{"sheet":"July","index":6,"n_rows":35,"n_cols":43,"rows_kept":35,"cut":false,"hidden":false,"merged":[[34,17,34,26],[34,32,34,41],[14,3,15,3],[14,4,15,4],[30,17,30,26],[30,32,30,41],[33,17,33,26],[33,32,33,41],[11,7,11,12],[5,6,5,8],[6,3,6,42],[8,7,8,31],[9,7,9,31],[10,7,10,31]]}
[]
[null,null,null,null,null,null,null,null,"File Name",null,null,null,{"$f":"CONCATENATE(CalendarYear,\".\",F6,\".\",VLOOKUP(H10,'BD1'!B16:D35,3,FALSE),\".\",H10)","v":{"$error":"#N/A"}}]
[null,null,null,null,null,null,null,null,"Sheet Name",null,null,null,{"$f":"CONCATENATE(E6,\".\",CalendarYear)","v":"July.2021"}]
[null,null,null,"Beginning of the week","SUN"]
[null,null,null,"Year",2021]
[null,null,null,"Month","July",{"$f":"VLOOKUP(E6,'BD1'!B2:C13,2,FALSE)","v":"07"}]
[null,null,null,"TIMESHEET"]
[]
[null,null,null,null,null,null,"DEPARTMENT/SERVICE: "]
[null,null,null,null,null,null,"NAME:"]
[null,null,null,null,null,null,"CATEGORY:"]
[null,null,null,null,null,null,"MONHT/YEAR:",{"$f":"CONCATENATE(E6,\"/\",CalendarYear)","v":"July/2021"}]
[]
[null,null,null,null,null,{"$f":"AND(MONTH(F16)=MONTH($G$6),COUNTIF(feriados,F16)>0)","v":false},false,false,false,false,false,false,false,false,false,false,false,false,false,false,false,false,false,false,false,false,false,false,false,false,false,false,false,false,false,false,false,false,false,false,false,false]
[null,null,null,"Project ","Tasks","Sun","Mon","Tue","Wed","Thu","Fri","Sat","Sun","Mon","Tue","Wed","Thu","Fri","Sat","Sun","Mon","Tue","Wed","Thu","Fri","Sat","Sun","Mon","Tue","Wed","Thu","Fri","Sat","Sun","Mon","Tue","Wed","Thu","Fri","Sat","Sun","Mon","TOTAL "]
{"$rows_left_out":21}
{"sheet":"Aug","index":7,"n_rows":35,"n_cols":43,"rows_kept":35,"cut":false,"hidden":false,"merged":[[34,17,34,26],[34,32,34,41],[14,3,15,3],[14,4,15,4],[30,17,30,26],[30,32,30,41],[33,17,33,26],[33,32,33,41],[11,7,11,12],[5,6,5,8],[6,3,6,42],[8,7,8,31],[9,7,9,31],[10,7,10,31]]}
[]
[null,null,null,null,null,null,null,null,"File Name",null,null,null,{"$f":"CONCATENATE(CalendarYear,\".\",F6,\".\",VLOOKUP(H10,'BD1'!B16:D35,3,FALSE),\".\",H10)","v":{"$error":"#N/A"}}]
[null,null,null,null,null,null,null,null,"Sheet Name",null,null,null,{"$f":"CONCATENATE(E6,\".\",CalendarYear)","v":"August.2021"}]
[null,null,null,"Beginning of the week","SUN"]
[null,null,null,"Year",2021]
[null,null,null,"Month","August",{"$f":"VLOOKUP(E6,'BD1'!B2:C13,2,FALSE)","v":"08"}]
[null,null,null,"TIMESHEET"]
[]
[null,null,null,null,null,null,"DEPARTMENT/SERVICE: "]
[null,null,null,null,null,null,"NAME:"]
[null,null,null,null,null,null,"CATEGORY:"]
[null,null,null,null,null,null,"MONHT/YEAR:",{"$f":"CONCATENATE(E6,\"/\",CalendarYear)","v":"August/2021"}]
[]
[null,null,null,null,null,{"$f":"AND(MONTH(F16)=MONTH($G$6),COUNTIF(feriados,F16)>0)","v":false},false,false,false,false,false,false,false,false,false,false,false,false,false,false,false,false,false,false,false,false,false,false,false,false,false,false,false,false,false,false,false,false,false,false,false,false]
[null,null,null,"Project ","Tasks","Sun","Mon","Tue","Wed","Thu","Fri","Sat","Sun","Mon","Tue","Wed","Thu","Fri","Sat","Sun","Mon","Tue","Wed","Thu","Fri","Sat","Sun","Mon","Tue","Wed","Thu","Fri","Sat","Sun","Mon","Tue","Wed","Thu","Fri","Sat","Sun","Mon","TOTAL "]
{"$rows_left_out":21}
{"sheet":"Sep","index":8,"n_rows":35,"n_cols":43,"rows_kept":35,"cut":false,"hidden":false,"merged":[[34,17,34,26],[34,32,34,41],[14,3,15,3],[14,4,15,4],[30,17,30,26],[30,32,30,41],[33,17,33,26],[33,32,33,41],[11,7,11,12],[5,6,5,8],[6,3,6,42],[8,7,8,31],[9,7,9,31],[10,7,10,31]]}
[]
[null,null,null,null,null,null,null,null,"File Name",null,null,null,{"$f":"CONCATENATE(CalendarYear,\".\",F6,\".\",VLOOKUP(H10,'BD1'!B16:D35,3,FALSE),\".\",H10)","v":{"$error":"#N/A"}}]
[null,null,null,null,null,null,null,null,"Sheet Name",null,null,null,{"$f":"CONCATENATE(E6,\".\",CalendarYear)","v":"September.2021"}]
[null,null,null,"Beginning of the week","SUN"]
[null,null,null,"Year",2021]
[null,null,null,"Month","September",{"$f":"VLOOKUP(E6,'BD1'!B2:C13,2,FALSE)","v":"09"}]
[null,null,null,"TIMESHEET"]
[]
[null,null,null,null,null,null,"DEPARTMENT/SERVICE: "]
[null,null,null,null,null,null,"NAME:"]
[null,null,null,null,null,null,"CATEGORY:"]
[null,null,null,null,null,null,"MONHT/YEAR:",{"$f":"CONCATENATE(E6,\"/\",CalendarYear)","v":"September/2021"}]
[]
[null,null,null,null,null,{"$f":"AND(MONTH(F16)=MONTH($G$6),COUNTIF(feriados,F16)>0)","v":false},false,false,false,false,false,false,false,false,false,false,false,false,false,false,false,false,false,false,false,false,false,false,false,false,false,false,false,false,false,false,false,false,false,false,false,false]
[null,null,null,"Project ","Tasks","Sun","Mon","Tue","Wed","Thu","Fri","Sat","Sun","Mon","Tue","Wed","Thu","Fri","Sat","Sun","Mon","Tue","Wed","Thu","Fri","Sat","Sun","Mon","Tue","Wed","Thu","Fri","Sat","Sun","Mon","Tue","Wed","Thu","Fri","Sat","Sun","Mon","TOTAL "]
{"$rows_left_out":21}
{"sheet":"Oct","index":9,"n_rows":35,"n_cols":43,"rows_kept":35,"cut":false,"hidden":false,"merged":[[34,17,34,26],[34,32,34,41],[14,3,15,3],[14,4,15,4],[30,17,30,26],[30,32,30,41],[33,17,33,26],[33,32,33,41],[11,7,11,12],[5,6,5,8],[6,3,6,42],[8,7,8,31],[9,7,9,31],[10,7,10,31]]}
[]
[null,null,null,null,null,null,null,null,"File Name",null,null,null,{"$f":"CONCATENATE(CalendarYear,\".\",F6,\".\",VLOOKUP(H10,'BD1'!B16:D35,3,FALSE),\".\",H10)","v":{"$error":"#N/A"}}]
[null,null,null,null,null,null,null,null,"Sheet Name",null,null,null,{"$f":"CONCATENATE(E6,\".\",CalendarYear)","v":"October.2021"}]
[null,null,null,"Beginning of the week","SUN"]
[null,null,null,"Year",2021]
[null,null,null,"Month","October",{"$f":"VLOOKUP(E6,'BD1'!B2:C13,2,FALSE)","v":10}]
[null,null,null,"TIMESHEET"]
[]
[null,null,null,null,null,null,"DEPARTMENT/SERVICE: "]
[null,null,null,null,null,null,"NAME:"]
[null,null,null,null,null,null,"CATEGORY:"]
[null,null,null,null,null,null,"MONHT/YEAR:",{"$f":"CONCATENATE(E6,\"/\",CalendarYear)","v":"October/2021"}]
[]
[null,null,null,null,null,{"$f":"AND(MONTH(F16)=MONTH($G$6),COUNTIF(feriados,F16)>0)","v":false},false,false,false,false,false,false,false,false,false,false,false,false,false,false,false,false,false,false,false,false,false,false,false,false,false,false,false,false,false,false,false,false,false,false,false,false]
[null,null,null,"Project ","Tasks","Sun","Mon","Tue","Wed","Thu","Fri","Sat","Sun","Mon","Tue","Wed","Thu","Fri","Sat","Sun","Mon","Tue","Wed","Thu","Fri","Sat","Sun","Mon","Tue","Wed","Thu","Fri","Sat","Sun","Mon","Tue","Wed","Thu","Fri","Sat","Sun","Mon","TOTAL "]
{"$rows_left_out":21}
{"sheet":"Nov","index":10,"n_rows":35,"n_cols":43,"rows_kept":35,"cut":false,"hidden":false,"merged":[[34,17,34,26],[34,32,34,41],[14,3,15,3],[14,4,15,4],[30,17,30,26],[30,32,30,41],[33,17,33,26],[33,32,33,41],[11,7,11,12],[5,6,5,8],[6,3,6,42],[8,7,8,31],[9,7,9,31],[10,7,10,31]]}
[]
[null,null,null,null,null,null,null,null,"File Name",null,null,null,{"$f":"CONCATENATE(CalendarYear,\".\",F6,\".\",VLOOKUP(H10,'BD1'!B16:D35,3,FALSE),\".\",H10)","v":{"$error":"#N/A"}}]
[null,null,null,null,null,null,null,null,"Sheet Name",null,null,null,{"$f":"CONCATENATE(E6,\".\",CalendarYear)","v":"November.2021"}]
[null,null,null,"Beginning of the week","SUN"]
[null,null,null,"Year",2021]
[null,null,null,"Month","November",{"$f":"VLOOKUP(E6,'BD1'!B2:C13,2,FALSE)","v":11}]
[null,null,null,"TIMESHEET"]
[]
[null,null,null,null,null,null,"DEPARTMENT/SERVICE: "]
[null,null,null,null,null,null,"NAME:"]
[null,null,null,null,null,null,"CATEGORY:"]
[null,null,null,null,null,null,"MONHT/YEAR:",{"$f":"CONCATENATE(E6,\"/\",CalendarYear)","v":"November/2021"}]
[]
[null,null,null,null,null,{"$f":"AND(MONTH(F16)=MONTH($G$6),COUNTIF(feriados,F16)>0)","v":false},false,false,false,false,false,false,false,false,false,false,false,false,false,false,false,false,false,false,false,false,false,false,false,false,false,false,false,false,false,false,false,false,false,false,false,false]
[null,null,null,"Project ","Tasks","Sun","Mon","Tue","Wed","Thu","Fri","Sat","Sun","Mon","Tue","Wed","Thu","Fri","Sat","Sun","Mon","Tue","Wed","Thu","Fri","Sat","Sun","Mon","Tue","Wed","Thu","Fri","Sat","Sun","Mon","Tue","Wed","Thu","Fri","Sat","Sun","Mon","TOTAL "]
{"$rows_left_out":21}
{"sheet":"Dec","index":11,"n_rows":35,"n_cols":43,"rows_kept":35,"cut":false,"hidden":false,"merged":[[34,17,34,26],[34,32,34,41],[14,3,15,3],[14,4,15,4],[30,17,30,26],[30,32,30,41],[33,17,33,26],[33,32,33,41],[11,7,11,12],[5,6,5,8],[6,3,6,42],[8,7,8,31],[9,7,9,31],[10,7,10,31]]}
[]
[null,null,null,null,null,null,null,null,"File Name",null,null,null,{"$f":"CONCATENATE(CalendarYear,\".\",F6,\".\",VLOOKUP(H10,'BD1'!B16:D35,3,FALSE),\".\",H10)","v":{"$error":"#N/A"}}]
[null,null,null,null,null,null,null,null,"Sheet Name",null,null,null,{"$f":"CONCATENATE(E6,\".\",CalendarYear)","v":"December.2021"}]
[null,null,null,"Beginning of the week","SUN"]
[null,null,null,"Year",2021]
[null,null,null,"Month","December",{"$f":"VLOOKUP(E6,'BD1'!B2:C13,2,FALSE)","v":12}]
[null,null,null,"TIMESHEET"]
[]
[null,null,null,null,null,null,"DEPARTMENT/SERVICE: "]
[null,null,null,null,null,null,"NAME:"]
[null,null,null,null,null,null,"CATEGORY:"]
[null,null,null,null,null,null,"MONHT/YEAR:",{"$f":"CONCATENATE(E6,\"/\",CalendarYear)","v":"December/2021"}]
[]
[null,null,null,null,null,{"$f":"AND(MONTH(F16)=MONTH($G$6),COUNTIF(feriados,F16)>0)","v":false},false,false,false,false,false,false,false,false,false,false,false,false,false,false,false,false,false,false,false,false,false,false,false,false,false,false,false,false,false,false,false,false,false,false,false,false]
[null,null,null,"Project ","Tasks","Sun","Mon","Tue","Wed","Thu","Fri","Sat","Sun","Mon","Tue","Wed","Thu","Fri","Sat","Sun","Mon","Tue","Wed","Thu","Fri","Sat","Sun","Mon","Tue","Wed","Thu","Fri","Sat","Sun","Mon","Tue","Wed","Thu","Fri","Sat","Sun","Mon","TOTAL "]
{"$rows_left_out":21}
{"sheet":"BD1","index":12,"n_rows":56,"n_cols":6,"rows_kept":56,"cut":false,"hidden":false,"merged":[]}
[null,"Month"]
[null,"January","01","janeiro"]
[null,"February","02","fevereiro"]
[null,"March","03","março"]
[null,"April","04","abril"]
[null,"May","05","maio"]
[null,"June","06","junho"]
[null,"July","07","julho"]
[null,"August","08","agosto"]
[null,"September","09","setembro"]
[null,"October",10,"outubro"]
[null,"November",11,"novembro"]
[null,"December",12,"dezembro"]
[]
[null,"NAME","CATEGORY","DEPARTMENT/SERVICE: ","PROJECT","TASK"]
{"$rows_left_out":41}