{"text_format":"1","workbook":"xlsx","n_sheets":13,"sheets":["January","February","March","April","May","June","July","August","September","October","November","December","BD1"],"not_rendered":{"charts":0,"images":1,"macros":1,"external_links":0,"defined_names":8,"comments":12,"pivot_tables":0},"unopened":[],"bounds":{"document_bytes":16777216,"sheet_cells":100000,"rows_first":2000,"rows_last":500,"rows_between":2000,"halvings":0,"cell_chars":16384,"cell_head_chars":4096},"cells_cut":0,"cells_raw":0,"read":"whole","date_system":"1900"}

{"sheet":"January","index":0,"n_rows":55,"n_cols":43,"rows_kept":55,"cut":false,"hidden":false,"merged":[[5,6,5,8],[6,3,6,42],[11,7,11,12],[8,7,8,31],[9,7,9,31],[10,7,10,31],[50,32,50,41],[53,32,53,41],[54,32,54,41],[50,17,50,26],[53,17,53,26],[54,17,54,26]]}
[]
[null,null,null,null,null,null,null,null,"Nome do Ficheiro",null,null,null,{"$f":"CONCATENATE(CalendarYear,\".\",F6,\".\",VLOOKUP(H10,'BD1'!F2:J14,4,FALSE))","v":{"$error":"#N/A"}}]
[null,null,null,null,null,null,null,null,"Nome de Folha",null,null,null,{"$f":"CONCATENATE(E6,\".\",CalendarYear)","v":"January.2023"}]
[null,null,null,"Início da semana","SUN"]
[null,null,null,"Ano",2023]
[null,null,null,"Mês","January",{"$f":"VLOOKUP(E6,'BD1'!B2:C13,2,FALSE)","v":"01"},{"$f":"R16","v":"2023-01-13"}]
[null,null,null,"TIMESHEET"]
[]
[null,null,null,null,null,null,"DEPARTMENT/SERVICE: "]
[null,null,null,null,null,null,"NAME:"]
[null,null,null,null,null,null,"CATEGORY:"]
[null,null,null,null,null,null,"MONHT/YEAR:",{"$f":"CONCATENATE(E6,\"/\",CalendarYear)","v":"January/2023"}]
[]
[null,null,null,null,null,{"$f":"AND(MONTH(F16)=MONTH($G$6),COUNTIF(feriados,F16)>0)","v":true},false,false,false,false,false,false,false,false,false,false,false,false,false,false,false,false,false,false,false,false,false,false,false,false,false,false,false,false,false,false,false,false,false,false,false,false]
[null,null,null,null,null,"Sun","Mon","Tue","Wed","Thu","Fri","Sat","Sun","Mon","Tue","Wed","Thu","Fri","Sat","Sun","Mon","Tue","Wed","Thu","Fri","Sat","Sun","Mon","Tue","Wed","Thu","Fri","Sat","Sun","Mon","Tue","Wed","Thu","Fri","Sat","Sun","Mon","TOTAL "]
{"$rows_left_out":41}
{"sheet":"February","index":1,"n_rows":55,"n_cols":43,"rows_kept":55,"cut":false,"hidden":false,"merged":[[11,7,11,12],[5,6,5,8],[6,3,6,42],[8,7,8,31],[9,7,9,31],[10,7,10,31],[50,17,50,26],[50,32,50,41],[53,17,53,26],[53,32,53,41],[54,17,54,26],[54,32,54,41]]}
[]
[null,null,null,null,null,null,null,null,"Nome do Ficheiro",null,null,null,{"$f":"CONCATENATE(CalendarYear,\".\",F6,\".\",VLOOKUP(H10,'BD1'!F2:J14,4,FALSE))","v":{"$error":"#N/A"}}]
[null,null,null,null,null,null,null,null,"Nome de Folha",null,null,null,{"$f":"CONCATENATE(E6,\".\",CalendarYear)","v":"February.2023"}]
[null,null,null,"Início da semana","SUN"]
[null,null,null,"Ano",2023]
[null,null,null,"Mês","February",{"$f":"VLOOKUP(E6,'BD1'!B2:C13,2,FALSE)","v":"02"},{"$f":"R16","v":"2023-02-10"}]
[null,null,null,"TIMESHEET"]
[]
[null,null,null,null,null,null,"DEPARTMENT/SERVICE: "]
[null,null,null,null,null,null,"NAME:"]
[null,null,null,null,null,null,"CATEGORY:"]
[null,null,null,null,null,null,"MONHT/YEAR:",{"$f":"CONCATENATE(E6,\"/\",CalendarYear)","v":"February/2023"}]
[]
[null,null,null,null,null,{"$f":"AND(MONTH(F16)=MONTH($G$6),COUNTIF(feriados,F16)>0)","v":false},false,false,false,false,false,false,false,false,false,false,false,false,false,false,false,false,false,false,false,false,false,false,true,false,false,false,false,false,false,false,false,false,false,false,false,false]
[null,null,null,null,null,"Sun","Mon","Tue","Wed","Thu","Fri","Sat","Sun","Mon","Tue","Wed","Thu","Fri","Sat","Sun","Mon","Tue","Wed","Thu","Fri","Sat","Sun","Mon","Tue","Wed","Thu","Fri","Sat","Sun","Mon","Tue","Wed","Thu","Fri","Sat","Sun","Mon","TOTAL "]
{"$rows_left_out":41}
{"sheet":"March","index":2,"n_rows":55,"n_cols":43,"rows_kept":55,"cut":false,"hidden":false,"merged":[[11,7,11,12],[5,6,5,8],[6,3,6,42],[8,7,8,31],[9,7,9,31],[10,7,10,31],[50,17,50,26],[50,32,50,41],[53,17,53,26],[53,32,53,41],[54,17,54,26],[54,32,54,41]]}
[]
[null,null,null,null,null,null,null,null,"Nome do Ficheiro",null,null,null,{"$f":"CONCATENATE(CalendarYear,\".\",F6,\".\",VLOOKUP(H10,'BD1'!F2:J14,4,FALSE))","v":{"$error":"#N/A"}}]
[null,null,null,null,null,null,null,null,"Nome de Folha",null,null,null,{"$f":"CONCATENATE(E6,\".\",CalendarYear)","v":"March.2023"}]
[null,null,null,"Início da semana","SUN"]
[null,null,null,"Ano",2023]
[null,null,null,"Mês","March",{"$f":"VLOOKUP(E6,'BD1'!B2:C13,2,FALSE)","v":"03"},{"$f":"R16","v":"2023-03-10"}]
[null,null,null,"TIMESHEET"]
[]
[null,null,null,null,null,null,"DEPARTMENT/SERVICE: "]
[null,null,null,null,null,null,"NAME:"]
[null,null,null,null,null,null,"CATEGORY:"]
[null,null,null,null,null,null,"MONHT/YEAR:",{"$f":"CONCATENATE(E6,\"/\",CalendarYear)","v":"March/2023"}]
[]
[null,null,null,null,null,{"$f":"AND(MONTH(F16)=MONTH($G$6),COUNTIF(feriados,F16)>0)","v":false},false,false,false,false,false,false,false,false,false,false,false,false,false,false,false,false,false,false,false,false,false,false,false,false,false,false,false,false,false,false,false,false,false,false,false,false]
[null,null,null,null,null,"Sun","Mon","Tue","Wed","Thu","Fri","Sat","Sun","Mon","Tue","Wed","Thu","Fri","Sat","Sun","Mon","Tue","Wed","Thu","Fri","Sat","Sun","Mon","Tue","Wed","Thu","Fri","Sat","Sun","Mon","Tue","Wed","Thu","Fri","Sat","Sun","Mon","TOTAL "]
{"$rows_left_out":41}
{"sheet":"April","index":3,"n_rows":55,"n_cols":43,"rows_kept":55,"cut":false,"hidden":false,"merged":[[11,7,11,12],[5,6,5,8],[6,3,6,42],[8,7,8,31],[9,7,9,31],[10,7,10,31],[50,17,50,26],[50,32,50,41],[53,17,53,26],[53,32,53,41],[54,17,54,26],[54,32,54,41]]}
[]
[null,null,null,null,null,null,null,null,"Nome do Ficheiro",null,null,null,{"$f":"CONCATENATE(CalendarYear,\".\",F6,\".\",VLOOKUP(H10,'BD1'!F2:J14,4,FALSE))","v":{"$error":"#N/A"}}]
[null,null,null,null,null,null,null,null,"Nome de Folha",null,null,null,{"$f":"CONCATENATE(E6,\".\",CalendarYear)","v":"April.2023"}]
[null,null,null,"Início da semana","SUN"]
[null,null,null,"Ano",2023]
[null,null,null,"Mês","April",{"$f":"VLOOKUP(E6,'BD1'!B2:C13,2,FALSE)","v":"04"},{"$f":"R16","v":"2023-04-07"}]
[null,null,null,"TIMESHEET"]
[]
[null,null,null,null,null,null,"DEPARTMENT/SERVICE: "]
[null,null,null,null,null,null,"NAME:"]
[null,null,null,null,null,null,"CATEGORY:"]
[null,null,null,null,null,null,"MONHT/YEAR:",{"$f":"CONCATENATE(E6,\"/\",CalendarYear)","v":"April/2023"}]
[]
[null,null,null,null,null,{"$f":"AND(MONTH(F16)=MONTH($G$6),COUNTIF(feriados,F16)>0)","v":false},false,false,false,false,false,false,false,false,false,false,false,true,false,true,false,false,false,false,false,false,false,false,false,false,false,false,false,false,false,true,false,false,false,false,false,false]
[null,null,null,null,null,"Sun","Mon","Tue","Wed","Thu","Fri","Sat","Sun","Mon","Tue","Wed","Thu","Fri","Sat","Sun","Mon","Tue","Wed","Thu","Fri","Sat","Sun","Mon","Tue","Wed","Thu","Fri","Sat","Sun","Mon","Tue","Wed","Thu","Fri","Sat","Sun","Mon","TOTAL "]
{"$rows_left_out":41}
{"sheet":"May","index":4,"n_rows":55,"n_cols":43,"rows_kept":55,"cut":false,"hidden":false,"merged":[[11,7,11,12],[5,6,5,8],[6,3,6,42],[8,7,8,31],[9,7,9,31],[10,7,10,31],[50,17,50,26],[50,32,50,41],[53,17,53,26],[53,32,53,41],[54,17,54,26],[54,32,54,41]]}
[]
[null,null,null,null,null,null,null,null,"Nome do Ficheiro",null,null,null,{"$f":"CONCATENATE(CalendarYear,\".\",F6,\".\",VLOOKUP(H10,'BD1'!F2:J14,4,FALSE))","v":{"$error":"#N/A"}}]
[null,null,null,null,null,null,null,null,"Nome de Folha",null,null,null,{"$f":"CONCATENATE(E6,\".\",CalendarYear)","v":"May.2023"}]
[null,null,null,"Início da semana","SUN"]
[null,null,null,"Ano",2023]
[null,null,null,"Mês","May",{"$f":"VLOOKUP(E6,'BD1'!B2:C13,2,FALSE)","v":"05"},{"$f":"R16","v":"2023-05-12"}]
[null,null,null,"TIMESHEET"]
[]
[null,null,null,null,null,null,"DEPARTMENT/SERVICE: "]
[null,null,null,null,null,null,"NAME:"]
[null,null,null,null,null,null,"CATEGORY:"]
[null,null,null,null,null,null,"MONHT/YEAR:",{"$f":"CONCATENATE(E6,\"/\",CalendarYear)","v":"May/2023"}]
[]
[null,null,null,null,null,{"$f":"AND(MONTH(F16)=MONTH($G$6),COUNTIF(feriados,F16)>0)","v":false},true,false,false,false,false,false,false,false,false,false,false,false,false,false,false,false,false,false,false,false,false,false,false,false,false,false,false,false,false,false,false,false,false,false,false,false]
[null,null,null,null,null,"Sun","Mon","Tue","Wed","Thu","Fri","Sat","Sun","Mon","Tue","Wed","Thu","Fri","Sat","Sun","Mon","Tue","Wed","Thu","Fri","Sat","Sun","Mon","Tue","Wed","Thu","Fri","Sat","Sun","Mon","Tue","Wed","Thu","Fri","Sat","Sun","Mon","TOTAL "]
{"$rows_left_out":41}
{"sheet":"June","index":5,"n_rows":55,"n_cols":43,"rows_kept":55,"cut":false,"hidden":false,"merged":[[11,7,11,12],[5,6,5,8],[6,3,6,42],[8,7,8,31],[9,7,9,31],[10,7,10,31],[50,17,50,26],[50,32,50,41],[53,17,53,26],[53,32,53,41],[54,17,54,26],[54,32,54,41]]}
[]
[null,null,null,null,null,null,null,null,"Nome do Ficheiro",null,null,null,{"$f":"CONCATENATE(CalendarYear,\".\",F6,\".\",VLOOKUP(H10,'BD1'!F2:J14,4,FALSE))","v":{"$error":"#N/A"}}]
[null,null,null,null,null,null,null,null,"Nome de Folha",null,null,null,{"$f":"CONCATENATE(E6,\".\",CalendarYear)","v":"June.2023"}]
[null,null,null,"Início da semana","SUN"]
[null,null,null,"Ano",2023]
[null,null,null,"Mês","June",{"$f":"VLOOKUP(E6,'BD1'!B2:C13,2,FALSE)","v":"06"},{"$f":"R16","v":"2023-06-09"}]
[null,null,null,"TIMESHEET"]
[]
[null,null,null,null,null,null,"DEPARTMENT/SERVICE: "]
[null,null,null,null,null,null,"NAME:"]
[null,null,null,null,null,null,"CATEGORY:"]
[null,null,null,null,null,null,"MONHT/YEAR:",{"$f":"CONCATENATE(E6,\"/\",CalendarYear)","v":"June/2023"}]
[]
[null,null,null,null,null,{"$f":"AND(MONTH(F16)=MONTH($G$6),COUNTIF(feriados,F16)>0)","v":false},false,false,false,false,false,false,false,false,false,false,true,false,true,false,false,true,false,false,false,false,false,false,false,false,false,false,false,false,false,false,false,false,false,false,false,false]
[null,null,null,null,null,"Sun","Mon","Tue","Wed","Thu","Fri","Sat","Sun","Mon","Tue","Wed","Thu","Fri","Sat","Sun","Mon","Tue","Wed","Thu","Fri","Sat","Sun","Mon","Tue","Wed","Thu","Fri","Sat","Sun","Mon","Tue","Wed","Thu","Fri","Sat","Sun","Mon","TOTAL "]
{"$rows_left_out":41}
{"sheet":"July","index":6,"n_rows":55,"n_cols":43,"rows_kept":55,"cut":false,"hidden":false,"merged":[[11,7,11,12],[5,6,5,8],[6,3,6,42],[8,7,8,31],[9,7,9,31],[10,7,10,31],[50,17,50,26],[50,32,50,41],[53,17,53,26],[53,32,53,41],[54,17,54,26],[54,32,54,41]]}
[]
[null,null,null,null,null,null,null,null,"Nome do Ficheiro",null,null,null,{"$f":"CONCATENATE(CalendarYear,\".\",F6,\".\",VLOOKUP(H10,'BD1'!F2:J14,4,FALSE))","v":{"$error":"#N/A"}}]
[null,null,null,null,null,null,null,null,"Nome de Folha",null,null,null,{"$f":"CONCATENATE(E6,\".\",CalendarYear)","v":"July.2023"}]
[null,null,null,"Início da semana","SUN"]
[null,null,null,"Ano",2023]
[null,null,null,"Mês","July",{"$f":"VLOOKUP(E6,'BD1'!B2:C13,2,FALSE)","v":"07"},{"$f":"R16","v":"2023-07-07"}]
[null,null,null,"TIMESHEET"]
[]
[null,null,null,null,null,null,"DEPARTMENT/SERVICE: "]
[null,null,null,null,null,null,"NAME:"]
[null,null,null,null,null,null,"CATEGORY:"]
[null,null,null,null,null,null,"MONHT/YEAR:",{"$f":"CONCATENATE(E6,\"/\",CalendarYear)","v":"July/2023"}]
[]
[null,null,null,null,null,{"$f":"AND(MONTH(F16)=MONTH($G$6),COUNTIF(feriados,F16)>0)","v":false},false,false,false,false,false,false,false,false,false,false,false,false,false,false,false,false,false,false,false,false,false,false,false,false,false,false,false,false,false,false,false,false,false,false,false,false]
[null,null,null,null,null,"Sun","Mon","Tue","Wed","Thu","Fri","Sat","Sun","Mon","Tue","Wed","Thu","Fri","Sat","Sun","Mon","Tue","Wed","Thu","Fri","Sat","Sun","Mon","Tue","Wed","Thu","Fri","Sat","Sun","Mon","Tue","Wed","Thu","Fri","Sat","Sun","Mon","TOTAL "]
{"$rows_left_out":41}
{"sheet":"August","index":7,"n_rows":55,"n_cols":43,"rows_kept":55,"cut":false,"hidden":false,"merged":[[11,7,11,12],[5,6,5,8],[6,3,6,42],[8,7,8,31],[9,7,9,31],[10,7,10,31],[50,17,50,26],[50,32,50,41],[53,17,53,26],[53,32,53,41],[54,17,54,26],[54,32,54,41]]}
[]
[null,null,null,null,null,null,null,null,"Nome do Ficheiro",null,null,null,{"$f":"CONCATENATE(CalendarYear,\".\",F6,\".\",VLOOKUP(H10,'BD1'!F2:J14,4,FALSE))","v":{"$error":"#N/A"}}]
[null,null,null,null,null,null,null,null,"Nome de Folha",null,null,null,{"$f":"CONCATENATE(E6,\".\",CalendarYear)","v":"August.2023"}]
[null,null,null,"Início da semana","SUN"]
[null,null,null,"Ano",2023]
[null,null,null,"Mês","August",{"$f":"VLOOKUP(E6,'BD1'!B2:C13,2,FALSE)","v":"08"},{"$f":"R16","v":"2023-08-11"}]
[null,null,null,"TIMESHEET"]
[]
[null,null,null,null,null,null,"DEPARTMENT/SERVICE: "]
[null,null,null,null,null,null,"NAME:"]
[null,null,null,null,null,null,"CATEGORY:"]
[null,null,null,null,null,null,"MONHT/YEAR:",{"$f":"CONCATENATE(E6,\"/\",CalendarYear)","v":"August/2023"}]
[]
[null,null,null,null,null,{"$f":"AND(MONTH(F16)=MONTH($G$6),COUNTIF(feriados,F16)>0)","v":false},false,false,false,false,false,false,false,false,false,false,false,false,false,false,false,true,false,false,false,false,false,false,false,false,false,false,false,false,false,false,false,false,false,false,false,false]
[null,null,null,null,null,"Sun","Mon","Tue","Wed","Thu","Fri","Sat","Sun","Mon","Tue","Wed","Thu","Fri","Sat","Sun","Mon","Tue","Wed","Thu","Fri","Sat","Sun","Mon","Tue","Wed","Thu","Fri","Sat","Sun","Mon","Tue","Wed","Thu","Fri","Sat","Sun","Mon","TOTAL "]
{"$rows_left_out":41}
{"sheet":"September","index":8,"n_rows":55,"n_cols":43,"rows_kept":55,"cut":false,"hidden":false,"merged":[[11,7,11,12],[5,6,5,8],[6,3,6,42],[8,7,8,31],[9,7,9,31],[10,7,10,31],[50,17,50,26],[50,32,50,41],[53,17,53,26],[53,32,53,41],[54,17,54,26],[54,32,54,41]]}
[]
[null,null,null,null,null,null,null,null,"Nome do Ficheiro",null,null,null,{"$f":"CONCATENATE(CalendarYear,\".\",F6,\".\",VLOOKUP(H10,'BD1'!F2:J14,4,FALSE))","v":{"$error":"#N/A"}}]
[null,null,null,null,null,null,null,null,"Nome de Folha",null,null,null,{"$f":"CONCATENATE(E6,\".\",CalendarYear)","v":"September.2023"}]
[null,null,null,"Início da semana","SUN"]
[null,null,null,"Ano",2023]
[null,null,null,"Mês","September",{"$f":"VLOOKUP(E6,'BD1'!B2:C13,2,FALSE)","v":"09"},{"$f":"R16","v":"2023-09-08"}]
[null,null,null,"TIMESHEET"]
[]
[null,null,null,null,null,null,"DEPARTMENT/SERVICE: "]
[null,null,null,null,null,null,"NAME:"]
[null,null,null,null,null,null,"CATEGORY:"]
[null,null,null,null,null,null,"MONHT/YEAR:",{"$f":"CONCATENATE(E6,\"/\",CalendarYear)","v":"September/2023"}]
[]
[null,null,null,null,null,{"$f":"AND(MONTH(F16)=MONTH($G$6),COUNTIF(feriados,F16)>0)","v":false},false,false,false,false,false,false,false,false,false,false,false,false,false,false,false,false,false,false,false,false,false,false,false,false,false,false,false,false,false,false,false,false,false,false,false,false]
[null,null,null,null,null,"Sun","Mon","Tue","Wed","Thu","Fri","Sat","Sun","Mon","Tue","Wed","Thu","Fri","Sat","Sun","Mon","Tue","Wed","Thu","Fri","Sat","Sun","Mon","Tue","Wed","Thu","Fri","Sat","Sun","Mon","Tue","Wed","Thu","Fri","Sat","Sun","Mon","TOTAL "]
{"$rows_left_out":41}
{"sheet":"October","index":9,"n_rows":55,"n_cols":43,"rows_kept":55,"cut":false,"hidden":false,"merged":[[11,7,11,12],[5,6,5,8],[6,3,6,42],[8,7,8,31],[9,7,9,31],[10,7,10,31],[50,17,50,26],[50,32,50,41],[53,17,53,26],[53,32,53,41],[54,17,54,26],[54,32,54,41]]}
[]
[null,null,null,null,null,null,null,null,"Nome do Ficheiro",null,null,null,{"$f":"CONCATENATE(CalendarYear,\".\",F6,\".\",VLOOKUP(H10,'BD1'!F2:J14,4,FALSE))","v":{"$error":"#N/A"}}]
[null,null,null,null,null,null,null,null,"Nome de Folha",null,null,null,{"$f":"CONCATENATE(E6,\".\",CalendarYear)","v":"October.2023"}]
[null,null,null,"Início da semana","SUN"]
[null,null,null,"Ano",2023]
[null,null,null,"Mês","October",{"$f":"VLOOKUP(E6,'BD1'!B2:C13,2,FALSE)","v":10},{"$f":"R16","v":"2023-10-13"}]
[null,null,null,"TIMESHEET"]
[]
[null,null,null,null,null,null,"DEPARTMENT/SERVICE: "]
[null,null,null,null,null,null,"NAME:"]
[null,null,null,null,null,null,"CATEGORY:"]
[null,null,null,null,null,null,"MONHT/YEAR:",{"$f":"CONCATENATE(E6,\"/\",CalendarYear)","v":"October/2023"}]
[]
[null,null,null,null,null,{"$f":"AND(MONTH(F16)=MONTH($G$6),COUNTIF(feriados,F16)>0)","v":false},false,false,false,true,false,false,false,false,false,false,false,false,false,false,false,false,false,false,false,false,false,false,false,false,false,false,false,false,false,false,false,false,false,false,false,false]
[null,null,null,null,null,"Sun","Mon","Tue","Wed","Thu","Fri","Sat","Sun","Mon","Tue","Wed","Thu","Fri","Sat","Sun","Mon","Tue","Wed","Thu","Fri","Sat","Sun","Mon","Tue","Wed","Thu","Fri","Sat","Sun","Mon","Tue","Wed","Thu","Fri","Sat","Sun","Mon","TOTAL "]
{"$rows_left_out":41}
{"sheet":"November","index":10,"n_rows":55,"n_cols":43,"rows_kept":55,"cut":false,"hidden":false,"merged":[[11,7,11,12],[5,6,5,8],[6,3,6,42],[8,7,8,31],[9,7,9,31],[10,7,10,31],[50,17,50,26],[50,32,50,41],[53,17,53,26],[53,32,53,41],[54,17,54,26],[54,32,54,41]]}
[]
[null,null,null,null,null,null,null,null,"Nome do Ficheiro",null,null,null,{"$f":"CONCATENATE(CalendarYear,\".\",F6,\".\",VLOOKUP(H10,'BD1'!F2:J14,4,FALSE))","v":{"$error":"#N/A"}}]
[null,null,null,null,null,null,null,null,"Nome de Folha",null,null,null,{"$f":"CONCATENATE(E6,\".\",CalendarYear)","v":"November.2023"}]
[null,null,null,"Início da semana","SUN"]
[null,null,null,"Ano",2023]
[null,null,null,"Mês","November",{"$f":"VLOOKUP(E6,'BD1'!B2:C13,2,FALSE)","v":11},{"$f":"R16","v":"2023-11-10"}]
[null,null,null,"TIMESHEET"]
[]
[null,null,null,null,null,null,"DEPARTMENT/SERVICE: "]
[null,null,null,null,null,null,"NAME:"]
[null,null,null,null,null,null,"CATEGORY:"]
[null,null,null,null,null,null,"MONHT/YEAR:",{"$f":"CONCATENATE(E6,\"/\",CalendarYear)","v":"November/2023"}]
[]
[null,null,null,null,null,{"$f":"AND(MONTH(F16)=MONTH($G$6),COUNTIF(feriados,F16)>0)","v":false},false,false,true,false,false,false,false,false,false,false,false,false,false,false,false,false,false,false,false,false,false,false,false,false,false,false,false,false,false,false,false,false,false,false,false,false]
[null,null,null,null,null,"Sun","Mon","Tue","Wed","Thu","Fri","Sat","Sun","Mon","Tue","Wed","Thu","Fri","Sat","Sun","Mon","Tue","Wed","Thu","Fri","Sat","Sun","Mon","Tue","Wed","Thu","Fri","Sat","Sun","Mon","Tue","Wed","Thu","Fri","Sat","Sun","Mon","TOTAL "]
{"$rows_left_out":41}
{"sheet":"December","index":11,"n_rows":55,"n_cols":43,"rows_kept":55,"cut":false,"hidden":false,"merged":[[11,7,11,12],[5,6,5,8],[6,3,6,42],[8,7,8,31],[9,7,9,31],[10,7,10,31],[50,17,50,26],[50,32,50,41],[53,17,53,26],[53,32,53,41],[54,17,54,26],[54,32,54,41]]}
[]
[null,null,null,null,null,null,null,null,"Nome do Ficheiro",null,null,null,{"$f":"CONCATENATE(CalendarYear,\".\",F6,\".\",VLOOKUP(H10,'BD1'!F2:J14,4,FALSE))","v":{"$error":"#N/A"}}]
[null,null,null,null,null,null,null,null,"Nome de Folha",null,null,null,{"$f":"CONCATENATE(E6,\".\",CalendarYear)","v":"December.2023"}]
[null,null,null,"Início da semana","SUN"]
[null,null,null,"Ano",2023]
[null,null,null,"Mês","December",{"$f":"VLOOKUP(E6,'BD1'!B2:C13,2,FALSE)","v":12},{"$f":"R16","v":"2023-12-08"}]
[null,null,null,"TIMESHEET"]
[]
[null,null,null,null,null,null,"DEPARTMENT/SERVICE: "]
[null,null,null,null,null,null,"NAME:"]
[null,null,null,null,null,null,"CATEGORY:"]
[null,null,null,null,null,null,"MONHT/YEAR:",{"$f":"CONCATENATE(E6,\"/\",CalendarYear)","v":"December/2023"}]
[]
[null,null,null,null,null,{"$f":"AND(MONTH(F16)=MONTH($G$6),COUNTIF(feriados,F16)>0)","v":false},false,false,false,false,true,false,false,false,false,false,false,true,false,false,false,false,false,false,false,false,false,false,false,false,false,false,false,false,true,false,false,false,false,false,false,false]
[null,null,null,null,null,"Sun","Mon","Tue","Wed","Thu","Fri","Sat","Sun","Mon","Tue","Wed","Thu","Fri","Sat","Sun","Mon","Tue","Wed","Thu","Fri","Sat","Sun","Mon","Tue","Wed","Thu","Fri","Sat","Sun","Mon","Tue","Wed","Thu","Fri","Sat","Sun","Mon","TOTAL "]
{"$rows_left_out":41}
{"sheet":"BD1","index":12,"n_rows":62,"n_cols":6,"rows_kept":62,"cut":false,"hidden":false,"merged":[]}
[null,"Mês"]
[null,"January","01","janeiro"]
[null,"February","02","fevereiro"]
[null,"March","03","março"]
[null,"April","04","abril"]
[null,"May","05","maio"]
[null,"June","06","junho"]
[null,"July","07","julho"]
[null,"August","08","agosto"]
[null,"September","09","setembro"]
[null,"October",10,"outubro"]
[null,"November",11,"novembro"]
[null,"December",12,"dezembro"]
[]
[]
{"$rows_left_out":47}